Reaction Details
TargetAromatase
LigandBDBM50265443
Substrate/Competitorn/a
Meas. Tech.ChEMBL_560810 (CHEMBL1011778)
Ki 25.5±n/a nM
Citation Neves, MADinis, TCColombo, GSá e Melo, ML Fast three dimensional pharmacophore virtual screening of new potent non-steroid aromatase inhibitors. J Med Chem52:143-50 (2009) 
 
Aromatase
Name:Aromatase
Type:Enzyme
Mol. Mass.:57888.92
Organism:Homo sapiens (Human)
Description:P11511
Residue:503
BDBM50265443
NameBDBM50265443
Synonyms:6-chloro-2-methoxy-N-(pyridin-3-yl)acridin-9-amine NSC-12999
TypeSmall organic molecule
Emp. Form.C19H14ClN3O
Mol. Mass.335.787
SMILESCOc1ccc2nc3cc(Cl)ccc3c(Nc3cccnc3)c2c1