Reaction Details
TargetAromatase
LigandBDBM50265464
Substrate/Competitorn/a
Meas. Tech.ChEMBL_560810 (CHEMBL1011778)
Ki 15.1±n/a nM
Citation Neves, MADinis, TCColombo, GSá e Melo, ML Fast three dimensional pharmacophore virtual screening of new potent non-steroid aromatase inhibitors. J Med Chem52:143-50 (2009) 
 
Aromatase
Name:Aromatase
Type:Enzyme
Mol. Mass.:57888.92
Organism:Homo sapiens (Human)
Description:P11511
Residue:503
BDBM50265464
NameBDBM50265464
Synonyms:4-(5-(4-chlorophenyl)-4-(pyridin-3-yl)-1H-imidazol-2-yl)phenol NSC-683634
TypeSmall organic molecule
Emp. Form.C20H14ClN3O
Mol. Mass.347.798
SMILESOc1ccc(cc1)-c1nc(c([nH]1)-c1ccc(Cl)cc1)-c1cccnc1