Reaction Details
TargetC-C chemokine receptor type 4
LigandBDBM50245036
Substrate/Competitorn/a
Meas. Tech.ChEMBL_558791 (CHEMBL1020785)
IC50 24±n/a nM
Citation Yokoyama, KIshikawa, NIgarashi, SKawano, NMasuda, NHamaguchi, WYamasaki, SKoganemaru, YHattori, KMiyazaki, TOgino, SMatsumoto, YTakeuchi, MOhta, M Potent and orally bioavailable CCR4 antagonists: Synthesis and structure-activity relationship study of 2-aminoquinazolines. Bioorg Med Chem17:64-73 (2008) 
 
C-C chemokine receptor type 4
Name:C-C chemokine receptor type 4
Type:Enzyme
Mol. Mass.:41406.41
Organism:Homo sapiens (Human)
Description:P51679
Residue:360
BDBM50245036
NameBDBM50245036
Synonyms:CHEMBL486840 | N-(4-Chlorophenyl)-6,7-dimethoxy-2-(4-pyrrolidin-1-ylpiperidin-1-yl)quinazolin-4-amine
TypeSmall organic molecule
Emp. Form.C25H30ClN5O2
Mol. Mass.467.991
SMILESCOc1cc2nc(nc(Nc3ccc(Cl)cc3)c2cc1OC)N1CCC(CC1)N1CCCC1