Reaction Details
TargetIntegrin alpha-IIb
LigandBDBM50277097
Substrate/Competitorn/a
Meas. Tech.ChEMBL_540409 (CHEMBL1029026)
IC50>10000±n/a nM
Citation Letourneau, JJLiu, JOhlmeyer, MHRiviello, CRong, YLi, HAppell, KCBansal, SJacob, BWong, AWebb, ML Synthesis and initial evaluation of novel, non-peptidic antagonists of the alpha(v)-integrins alpha(v)beta(3) and alpha(v)beta(5). Bioorg Med Chem Lett19:352-5 (2008) 
 
Integrin alpha-IIb
Name:Integrin alpha-IIb
Type:Protein
Mol. Mass.:113354.85
Organism:Homo sapiens (Human)
Description:P08514
Residue:1039
BDBM50277097
NameBDBM50277097
Synonyms:3-(7-(2-amino-1-methyl-1H-benzo[d]imidazol-4-yloxy)-1-oxo-4,5-dihydro-1H-benzo[c]azepin-2(3H)-yl)propanoic acid | CHEMBL518086
TypeSmall organic molecule
Emp. Form.C21H22N4O4
Mol. Mass.394.4238
SMILESCn1c(N)nc2c(Oc3ccc4c(CCCN(CCC(O)=O)C4=O)c3)cccc12