Reaction Details
TargetIntegrin alpha-IIb
LigandBDBM50277098
Substrate/Competitorn/a
Meas. Tech.ChEMBL_540409 (CHEMBL1029026)
IC50 6300±n/a nM
Citation Letourneau, JJLiu, JOhlmeyer, MHRiviello, CRong, YLi, HAppell, KCBansal, SJacob, BWong, AWebb, ML Synthesis and initial evaluation of novel, non-peptidic antagonists of the alpha(v)-integrins alpha(v)beta(3) and alpha(v)beta(5). Bioorg Med Chem Lett19:352-5 (2008) 
 
Integrin alpha-IIb
Name:Integrin alpha-IIb
Type:Protein
Mol. Mass.:113354.85
Organism:Homo sapiens (Human)
Description:P08514
Residue:1039
BDBM50277098
NameBDBM50277098
Synonyms:3-[1-Oxo-6-(1,2,3,4-tetrahydro-benzo[4,5]imidazo[1,2-a]pyrimidin-9-yloxy)-3,4-dihydro-1H-isoquinolin-2-yl]-propionic acid | CHEMBL464400
TypeSmall organic molecule
Emp. Form.C22H22N4O4
Mol. Mass.406.4345
SMILESOC(=O)CCN1CCc2cc(Oc3cccc4n5CCCNc5nc34)ccc2C1=O