Reaction Details
TargetSphingosine 1-phosphate receptor 4
LigandBDBM50277149
Substrate/Competitorn/a
Meas. Tech.ChEMBL_540420 (CHEMBL1029037)
IC50 3.5±n/a nM
Citation Evindar, GBernier, SGKavarana, MJDoyle, ELorusso, JKelley, MSHalley, KHutchings, AWright, ADSaha, AKHannig, GMorgan, BAWestlin, WF Synthesis and evaluation of alkoxy-phenylamides and alkoxy-phenylimidazoles as potent sphingosine-1-phosphate receptor subtype-1 agonists. Bioorg Med Chem Lett19:369-72 (2008) 
 
Sphingosine 1-phosphate receptor 4
Name:Sphingosine 1-phosphate receptor 4
Type:G Protein-Coupled Receptor (GPCR)
Mol. Mass.:41647.39
Organism:Homo sapiens (Human)
Description:n/a
Residue:384
BDBM50277149
NameBDBM50277149
Synonyms:(S)-2-amino-3-(3-fluoro-4-(octyloxy)phenylamino)-2-methyl-3-oxopropyl dihydrogen phosphate | CHEMBL515921
TypeSmall organic molecule
Emp. Form.C18H30FN2O6P
Mol. Mass.420.4128
SMILESCCCCCCCCOc1ccc(NC(=O)[C@@](C)(N)COP(O)(O)=O)cc1F