Reaction Details
TargetSphingosine 1-phosphate receptor 1
LigandBDBM50277186
Substrate/Competitorn/a
Meas. Tech.ChEMBL_540418 (CHEMBL1029035)
IC50 0.26±n/a nM
Citation Evindar, GBernier, SGKavarana, MJDoyle, ELorusso, JKelley, MSHalley, KHutchings, AWright, ADSaha, AKHannig, GMorgan, BAWestlin, WF Synthesis and evaluation of alkoxy-phenylamides and alkoxy-phenylimidazoles as potent sphingosine-1-phosphate receptor subtype-1 agonists. Bioorg Med Chem Lett19:369-72 (2008) 
 
Sphingosine 1-phosphate receptor 1
Name:Sphingosine 1-phosphate receptor 1
Type:Enzyme
Mol. Mass.:42836.02
Organism:Homo sapiens (Human)
Description:P21453
Residue:382
BDBM50277186
NameBDBM50277186
Synonyms:(R)-2-amino-2-(4-(4-(octyloxy)phenyl)-1H-imidazol-2-yl)propyl dihydrogen phosphate | CHEMBL474689
TypeSmall organic molecule
Emp. Form.C20H32N3O5P
Mol. Mass.425.4589
SMILESCCCCCCCCOc1ccc(cc1)-c1c[nH]c(n1)[C@@](C)(N)COP(O)(O)=O