Reaction Details
TargetSphingosine 1-phosphate receptor 1
LigandBDBM50277187
Substrate/Competitorn/a
Meas. Tech.ChEMBL_540423 (CHEMBL1029040)
EC50 0.45±n/a nM
Citation Evindar, GBernier, SGKavarana, MJDoyle, ELorusso, JKelley, MSHalley, KHutchings, AWright, ADSaha, AKHannig, GMorgan, BAWestlin, WF Synthesis and evaluation of alkoxy-phenylamides and alkoxy-phenylimidazoles as potent sphingosine-1-phosphate receptor subtype-1 agonists. Bioorg Med Chem Lett19:369-72 (2008) 
 
Sphingosine 1-phosphate receptor 1
Name:Sphingosine 1-phosphate receptor 1
Type:Enzyme
Mol. Mass.:42836.02
Organism:Homo sapiens (Human)
Description:P21453
Residue:382
BDBM50277187
NameBDBM50277187
Synonyms:(R)-2-amino-2-(4-(3-fluoro-4-(octyloxy)phenyl)-1H-imidazol-2-yl)propyl dihydrogen phosphate | CHEMBL473269
TypeSmall organic molecule
Emp. Form.C20H31FN3O5P
Mol. Mass.443.4494
SMILESCCCCCCCCOc1ccc(cc1F)-c1c[nH]c(n1)[C@@](C)(N)COP(O)(O)=O