Reaction Details
TargetMacrophage migration inhibitory factor
LigandBDBM50096001
Substrate/Competitorn/a
Meas. Tech.ChEMBL_558850 (CHEMBL1021636)
Ki 500±n/a nM
Citation Cournia, ZLeng, LGandavadi, SDu, XBucala, RJorgensen, WL Discovery of human macrophage migration inhibitory factor (MIF)-CD74 antagonists via virtual screening. J Med Chem52:416-24 (2009) 
 
Macrophage migration inhibitory factor
Name:Macrophage migration inhibitory factor
Type:Enzyme
Mol. Mass.:12478.18
Organism:Homo sapiens (Human)
Description:P14174
Residue:115
BDBM50096001
NameBDBM50096001
Synonyms:7-Hydroxy-3-pyrazolo[1,5-a]pyridin-2-yl-chromen-2-one CHEMBL153425
TypeSmall organic molecule
Emp. Form.C16H10N2O3
Mol. Mass.278.2622
SMILESOc1ccc2cc(-c3cc4ccccn4n3)c(=O)oc2c1