Reaction Details
TargetDelta-type opioid receptor
LigandBDBM50277117
Substrate/Competitorn/a
Meas. Tech.ChEMBL_540501 (CHEMBL1030605)
Ki 160±n/a nM
Citation Wentland, MPLu, QGanorkar, RZhang, SZJo, SCohen, DJBidlack, JM Redefining the structure-activity relationships of 2,6-methano-3-benzazocines. Part 7: syntheses and opioid receptor properties of cyclic variants of cyclazocine. Bioorg Med Chem Lett19:365-8 (2008) 
 
Delta-type opioid receptor
Name:Delta-type opioid receptor
Type:G Protein-Coupled Receptor (GPCR)
Mol. Mass.:40382.98
Organism:Homo sapiens (Human)
Description:Competition binding assays were carried out using membrane preparations from transfected HN9.10 cells that constitutively expressed the delta opioid receptor.
Residue:372
BDBM50277117
NameBDBM50277117
Synonyms:(1S,16R)-13-(cyclopropylmethyl)-1,5,16-trimethyl-4,6,13-triazatetracyclo[10.3.1.0^{2,10}.0^{3,7}]hexadeca-2,4,7,9-tetraene | CHEMBL506290
TypeSmall organic molecule
Emp. Form.C20H27N3
Mol. Mass.309.4485
SMILESC[C@H]1C2Cc3ccc4nc(C)[nH]c4c3[C@@]1(C)CCN2CC1CC1