Reaction Details
TargetMu-type opioid receptor
LigandBDBM50277101
Substrate/Competitorn/a
Meas. Tech.ChEMBL_540500 (CHEMBL1030604)
Ki 0.310000±n/a nM
Citation Wentland, MPLu, QGanorkar, RZhang, SZJo, SCohen, DJBidlack, JM Redefining the structure-activity relationships of 2,6-methano-3-benzazocines. Part 7: syntheses and opioid receptor properties of cyclic variants of cyclazocine. Bioorg Med Chem Lett19:365-8 (2008) 
 
Mu-type opioid receptor
Name:Mu-type opioid receptor
Type:G Protein-Coupled Receptor (GPCR)
Mol. Mass.:44789.51
Organism:Homo sapiens (Human)
Description:P35372
Residue:400
BDBM50277101
NameBDBM50277101
Synonyms:(1S,16R)-13-(cyclopropylmethyl)-1,16-dimethyl-5,7,13-triazatetracyclo[10.3.1.0^{2,10}.0^{4,8}]hexadeca-2,4(8),6,9-tetraene | CHEMBL518712
TypeSmall organic molecule
Emp. Form.C19H25N3
Mol. Mass.295.4219
SMILESC[C@H]1C2Cc3cc4[nH]cnc4cc3[C@@]1(C)CCN2CC1CC1