Reaction Details
TargetMu-type opioid receptor
LigandBDBM50001023
Substrate/Competitorn/a
Meas. Tech.ChEMBL_540500 (CHEMBL1030604)
Ki 0.160000±n/a nM
Citation Wentland, MPLu, QGanorkar, RZhang, SZJo, SCohen, DJBidlack, JM Redefining the structure-activity relationships of 2,6-methano-3-benzazocines. Part 7: syntheses and opioid receptor properties of cyclic variants of cyclazocine. Bioorg Med Chem Lett19:365-8 (2008) 
 
Mu-type opioid receptor
Name:Mu-type opioid receptor
Type:G Protein-Coupled Receptor (GPCR)
Mol. Mass.:44789.51
Organism:Homo sapiens (Human)
Description:P35372
Residue:400
BDBM50001023
NameBDBM50001023
Synonyms:(2R,6R,11R)-3-Cyclopropylmethyl-6,11-dimethyl-1,2,3,4,5,6-hexahydro-2,6-methano-benzo[d]azocin-8-ol CHEMBL56585 US10231963, Table B.9 US11534436, Compound Table B.9 | US9656961, Example 00126
TypeSmall organic molecule
Emp. Form.C18H25NO
Mol. Mass.271.3972
SMILESC[C@H]1[C@H]2Cc3ccc(O)cc3[C@]1(C)CCN2CC1CC1