Reaction Details
TargetMu-type opioid receptor
LigandBDBM50277118
Substrate/Competitorn/a
Meas. Tech.ChEMBL_540508 (CHEMBL1030612)
IC50 99±n/a nM
Citation Wentland, MPLu, QGanorkar, RZhang, SZJo, SCohen, DJBidlack, JM Redefining the structure-activity relationships of 2,6-methano-3-benzazocines. Part 7: syntheses and opioid receptor properties of cyclic variants of cyclazocine. Bioorg Med Chem Lett19:365-8 (2008) 
 
Mu-type opioid receptor
Name:Mu-type opioid receptor
Type:G Protein-Coupled Receptor (GPCR)
Mol. Mass.:44789.51
Organism:Homo sapiens (Human)
Description:P35372
Residue:400
BDBM50277118
NameBDBM50277118
Synonyms:(1S,16R)-13-(cyclopropylmethyl)-1,16-dimethyl-4,5,6,13-tetraazatetracyclo[10.3.1.0^{2,10}.0^{3,7}]hexadeca-2,4,7,9-tetraene | CHEMBL475108
TypeSmall organic molecule
Emp. Form.C18H24N4
Mol. Mass.296.41
SMILESC[C@H]1C2Cc3ccc4nn[nH]c4c3[C@@]1(C)CCN2CC1CC1