Reaction Details
TargetKappa-type opioid receptor
LigandBDBM50277116
Substrate/Competitorn/a
Meas. Tech.ChEMBL_540506 (CHEMBL1030610)
Ki 0.920000±n/a nM
Citation Wentland, MPLu, QGanorkar, RZhang, SZJo, SCohen, DJBidlack, JM Redefining the structure-activity relationships of 2,6-methano-3-benzazocines. Part 7: syntheses and opioid receptor properties of cyclic variants of cyclazocine. Bioorg Med Chem Lett19:365-8 (2008) 
 
Kappa-type opioid receptor
Name:Kappa-type opioid receptor
Type:G Protein-Coupled Receptor (GPCR)
Mol. Mass.:42648.76
Organism:Homo sapiens (Human)
Description:P41145
Residue:380
BDBM50277116
NameBDBM50277116
Synonyms:(1S,16R)-13-(cyclopropylmethyl)-1,16-dimethyl-4,6,13-triazatetracyclo[10.3.1.0^{2,10}.0^{3,7}]hexadeca-2,4,7,9-tetraene | CHEMBL475107
TypeSmall organic molecule
Emp. Form.C19H25N3
Mol. Mass.295.4219
SMILESC[C@H]1C2Cc3ccc4nc[nH]c4c3[C@@]1(C)CCN2CC1CC1