Reaction Details
TargetCannabinoid receptor 1
LigandBDBM50277267
Substrate/Competitorn/a
Meas. Tech.ChEMBL_540511 (CHEMBL1030615)
Ki 1100±n/a nM
Citation Goodman, AJAjello, CWWorm, KLe Bourdonnec, BSavolainen, MAO'Hare, HCassel, JAStabley, GJDehaven, RNLabuda, CJKoblish, MLittle, PJBrogdon, BLSmith, SADolle, RE CB2 selective sulfamoyl benzamides: optimization of the amide functionality. Bioorg Med Chem Lett19:309-13 (2008) 
 
Cannabinoid receptor 1
Name:Cannabinoid receptor 1
Type:G Protein-Coupled Receptor (GPCR)
Mol. Mass.:52868.96
Organism:Homo sapiens (Human)
Description:P21554
Residue:472
BDBM50277267
NameBDBM50277267
Synonyms:4-(5-(4-tert-butyl-1H-imidazol-2-yl)-2-methylphenylsulfonyl)morpholine | CHEMBL500856
TypeSmall organic molecule
Emp. Form.C18H25N3O3S
Mol. Mass.363.474
SMILESCc1ccc(cc1S(=O)(=O)N1CCOCC1)-c1nc(c[nH]1)C(C)(C)C