Reaction Details
TargetCannabinoid receptor 2
LigandBDBM50277269
Substrate/Competitorn/a
Meas. Tech.ChEMBL_540514 (CHEMBL1031455)
EC50 70±n/a nM
Citation Goodman, AJAjello, CWWorm, KLe Bourdonnec, BSavolainen, MAO'Hare, HCassel, JAStabley, GJDehaven, RNLabuda, CJKoblish, MLittle, PJBrogdon, BLSmith, SADolle, RE CB2 selective sulfamoyl benzamides: optimization of the amide functionality. Bioorg Med Chem Lett19:309-13 (2008) 
 
Cannabinoid receptor 2
Name:Cannabinoid receptor 2
Type:G Protein-Coupled Receptor (GPCR)
Mol. Mass.:39690.94
Organism:Homo sapiens (Human)
Description:P34972
Residue:360
BDBM50277269
NameBDBM50277269
Synonyms:4-(2-methyl-5-(5-neopentyl-1,2,4-oxadiazol-3-yl)phenylsulfonyl)morpholine | CHEMBL472679
TypeSmall organic molecule
Emp. Form.C18H25N3O4S
Mol. Mass.379.474
SMILESCc1ccc(cc1S(=O)(=O)N1CCOCC1)-c1noc(CC(C)(C)C)n1