Reaction Details
TargetCannabinoid receptor 2
LigandBDBM50277270
Substrate/Competitorn/a
Meas. Tech.ChEMBL_540512 (CHEMBL1030616)
Ki 130±n/a nM
Citation Goodman, AJAjello, CWWorm, KLe Bourdonnec, BSavolainen, MAO'Hare, HCassel, JAStabley, GJDehaven, RNLabuda, CJKoblish, MLittle, PJBrogdon, BLSmith, SADolle, RE CB2 selective sulfamoyl benzamides: optimization of the amide functionality. Bioorg Med Chem Lett19:309-13 (2008) 
 
Cannabinoid receptor 2
Name:Cannabinoid receptor 2
Type:G Protein-Coupled Receptor (GPCR)
Mol. Mass.:39690.94
Organism:Homo sapiens (Human)
Description:P34972
Residue:360
BDBM50277270
NameBDBM50277270
Synonyms:4-(5-(5-(cyclohexylmethyl)-1,2,4-oxadiazol-3-yl)-2-methylphenylsulfonyl)morpholine | CHEMBL472680
TypeSmall organic molecule
Emp. Form.C20H27N3O4S
Mol. Mass.405.511
SMILESCc1ccc(cc1S(=O)(=O)N1CCOCC1)-c1noc(CC2CCCCC2)n1