Reaction Details
TargetCannabinoid receptor 2
LigandBDBM50277136
Substrate/Competitorn/a
Meas. Tech.ChEMBL_540512 (CHEMBL1030616)
Ki 75±n/a nM
Citation Goodman, AJAjello, CWWorm, KLe Bourdonnec, BSavolainen, MAO'Hare, HCassel, JAStabley, GJDehaven, RNLabuda, CJKoblish, MLittle, PJBrogdon, BLSmith, SADolle, RE CB2 selective sulfamoyl benzamides: optimization of the amide functionality. Bioorg Med Chem Lett19:309-13 (2008) 
 
Cannabinoid receptor 2
Name:Cannabinoid receptor 2
Type:G Protein-Coupled Receptor (GPCR)
Mol. Mass.:39690.94
Organism:Homo sapiens (Human)
Description:P34972
Residue:360
BDBM50277136
NameBDBM50277136
Synonyms:4-(5-(5-tert-butyl-1,2,4-oxadiazol-3-yl)-2-methylphenylsulfonyl)morpholine | CHEMBL508362
TypeSmall organic molecule
Emp. Form.C17H23N3O4S
Mol. Mass.365.447
SMILESCc1ccc(cc1S(=O)(=O)N1CCOCC1)-c1noc(n1)C(C)(C)C