Reaction Details
TargetCannabinoid receptor 2
LigandBDBM50277339
Substrate/Competitorn/a
Meas. Tech.ChEMBL_540512 (CHEMBL1030616)
Ki 23±n/a nM
Citation Goodman, AJAjello, CWWorm, KLe Bourdonnec, BSavolainen, MAO'Hare, HCassel, JAStabley, GJDehaven, RNLabuda, CJKoblish, MLittle, PJBrogdon, BLSmith, SADolle, RE CB2 selective sulfamoyl benzamides: optimization of the amide functionality. Bioorg Med Chem Lett19:309-13 (2008) 
 
Cannabinoid receptor 2
Name:Cannabinoid receptor 2
Type:G Protein-Coupled Receptor (GPCR)
Mol. Mass.:39690.94
Organism:Homo sapiens (Human)
Description:P34972
Residue:360
BDBM50277339
NameBDBM50277339
Synonyms:2,2,3,3-tetramethyl-N-(4-methyl-3-(morpholinosulfonyl)phenyl)cyclopropanecarboxamide | CHEMBL472856
TypeSmall organic molecule
Emp. Form.C19H28N2O4S
Mol. Mass.380.502
SMILESCc1ccc(NC(=O)C2C(C)(C)C2(C)C)cc1S(=O)(=O)N1CCOCC1