Reaction Details
TargetCannabinoid receptor 2
LigandBDBM50277340
Substrate/Competitorn/a
Meas. Tech.ChEMBL_540512 (CHEMBL1030616)
Ki 35±n/a nM
Citation Goodman, AJAjello, CWWorm, KLe Bourdonnec, BSavolainen, MAO'Hare, HCassel, JAStabley, GJDehaven, RNLabuda, CJKoblish, MLittle, PJBrogdon, BLSmith, SADolle, RE CB2 selective sulfamoyl benzamides: optimization of the amide functionality. Bioorg Med Chem Lett19:309-13 (2008) 
 
Cannabinoid receptor 2
Name:Cannabinoid receptor 2
Type:G Protein-Coupled Receptor (GPCR)
Mol. Mass.:39690.94
Organism:Homo sapiens (Human)
Description:P34972
Residue:360
BDBM50277340
NameBDBM50277340
Synonyms:1-methyl-N-(4-methyl-3-(morpholinosulfonyl)phenyl)cyclohexanecarboxamide | CHEMBL515866
TypeSmall organic molecule
Emp. Form.C19H28N2O4S
Mol. Mass.380.502
SMILESCc1ccc(NC(=O)C2(C)CCCCC2)cc1S(=O)(=O)N1CCOCC1