Reaction Details
TargetCannabinoid receptor 1
LigandBDBM50277341
Substrate/Competitorn/a
Meas. Tech.ChEMBL_540511 (CHEMBL1030615)
Ki 1900±n/a nM
Citation Goodman, AJAjello, CWWorm, KLe Bourdonnec, BSavolainen, MAO'Hare, HCassel, JAStabley, GJDehaven, RNLabuda, CJKoblish, MLittle, PJBrogdon, BLSmith, SADolle, RE CB2 selective sulfamoyl benzamides: optimization of the amide functionality. Bioorg Med Chem Lett19:309-13 (2008) 
 
Cannabinoid receptor 1
Name:Cannabinoid receptor 1
Type:G Protein-Coupled Receptor (GPCR)
Mol. Mass.:52868.96
Organism:Homo sapiens (Human)
Description:P21554
Residue:472
BDBM50277341
NameBDBM50277341
Synonyms:CHEMBL470231 | N-(4-methyl-3-(morpholinosulfonyl)phenyl)cyclohexanecarboxamide
TypeSmall organic molecule
Emp. Form.C18H26N2O4S
Mol. Mass.366.475
SMILESCc1ccc(NC(=O)C2CCCCC2)cc1S(=O)(=O)N1CCOCC1