Reaction Details
TargetCannabinoid receptor 1
LigandBDBM50277377
Substrate/Competitorn/a
Meas. Tech.ChEMBL_540511 (CHEMBL1030615)
Ki 1100±n/a nM
Citation Goodman, AJAjello, CWWorm, KLe Bourdonnec, BSavolainen, MAO'Hare, HCassel, JAStabley, GJDehaven, RNLabuda, CJKoblish, MLittle, PJBrogdon, BLSmith, SADolle, RE CB2 selective sulfamoyl benzamides: optimization of the amide functionality. Bioorg Med Chem Lett19:309-13 (2008) 
 
Cannabinoid receptor 1
Name:Cannabinoid receptor 1
Type:G Protein-Coupled Receptor (GPCR)
Mol. Mass.:52868.96
Organism:Homo sapiens (Human)
Description:P21554
Residue:472
BDBM50277377
NameBDBM50277377
Synonyms:2-chloro-N-(4-methyl-3-(morpholinosulfonyl)phenyl)benzamide | CHEMBL516368
TypeSmall organic molecule
Emp. Form.C18H19ClN2O4S
Mol. Mass.394.872
SMILESCc1ccc(NC(=O)c2ccccc2Cl)cc1S(=O)(=O)N1CCOCC1