Reaction Details
TargetCannabinoid receptor 2
LigandBDBM50277380
Substrate/Competitorn/a
Meas. Tech.ChEMBL_540512 (CHEMBL1030616)
Ki 2000±n/a nM
Citation Goodman, AJAjello, CWWorm, KLe Bourdonnec, BSavolainen, MAO'Hare, HCassel, JAStabley, GJDehaven, RNLabuda, CJKoblish, MLittle, PJBrogdon, BLSmith, SADolle, RE CB2 selective sulfamoyl benzamides: optimization of the amide functionality. Bioorg Med Chem Lett19:309-13 (2008) 
 
Cannabinoid receptor 2
Name:Cannabinoid receptor 2
Type:G Protein-Coupled Receptor (GPCR)
Mol. Mass.:39690.94
Organism:Homo sapiens (Human)
Description:P34972
Residue:360
BDBM50277380
NameBDBM50277380
Synonyms:(1S,2S,4R)-1,4-dimethyl-N-(4-methyl-3-(morpholinosulfonyl)phenyl)-7-oxabicyclo[2.2.1]heptane-2-carboxamide | CHEMBL475500
TypeSmall organic molecule
Emp. Form.C20H28N2O5S
Mol. Mass.408.512
SMILESCc1ccc(NC(=O)[C@H]2C[C@@]3(C)CC[C@]2(C)O3)cc1S(=O)(=O)N1CCOCC1