Reaction Details
TargetCannabinoid receptor 2
LigandBDBM50277307
Substrate/Competitorn/a
Meas. Tech.ChEMBL_540512 (CHEMBL1030616)
Ki 9.4±n/a nM
Citation Goodman, AJAjello, CWWorm, KLe Bourdonnec, BSavolainen, MAO'Hare, HCassel, JAStabley, GJDehaven, RNLabuda, CJKoblish, MLittle, PJBrogdon, BLSmith, SADolle, RE CB2 selective sulfamoyl benzamides: optimization of the amide functionality. Bioorg Med Chem Lett19:309-13 (2008) 
 
Cannabinoid receptor 2
Name:Cannabinoid receptor 2
Type:G Protein-Coupled Receptor (GPCR)
Mol. Mass.:39690.94
Organism:Homo sapiens (Human)
Description:P34972
Residue:360
BDBM50277307
NameBDBM50277307
Synonyms:(1S,2R,4R)-1,3,3-trimethyl-N-(4-methyl-3-(morpholinosulfonyl)phenyl)bicyclo[2.2.1]heptane-2-carboxamide | CHEMBL516057
TypeSmall organic molecule
Emp. Form.C22H32N2O4S
Mol. Mass.420.565
SMILESCc1ccc(NC(=O)[C@@H]2[C@@]3(C)CC[C@H](C3)C2(C)C)cc1S(=O)(=O)N1CCOCC1