Reaction Details
TargetCannabinoid receptor 2
LigandBDBM50239215
Substrate/Competitorn/a
Meas. Tech.ChEMBL_540514 (CHEMBL1031455)
EC50 21±n/a nM
Citation Goodman, AJAjello, CWWorm, KLe Bourdonnec, BSavolainen, MAO'Hare, HCassel, JAStabley, GJDehaven, RNLabuda, CJKoblish, MLittle, PJBrogdon, BLSmith, SADolle, RE CB2 selective sulfamoyl benzamides: optimization of the amide functionality. Bioorg Med Chem Lett19:309-13 (2008) 
 
Cannabinoid receptor 2
Name:Cannabinoid receptor 2
Type:G Protein-Coupled Receptor (GPCR)
Mol. Mass.:39690.94
Organism:Homo sapiens (Human)
Description:P34972
Residue:360
BDBM50239215
NameBDBM50239215
Synonyms:4-methyl-3-(morpholinosulfonyl)-N-(2,2,4,4-tetramethylpentan-3-yl)benzamide | CHEMBL258242
TypeSmall organic molecule
Emp. Form.C21H34N2O4S
Mol. Mass.410.571
SMILESCc1ccc(cc1S(=O)(=O)N1CCOCC1)C(=O)NC(C(C)(C)C)C(C)(C)C