Reaction Details
TargetCannabinoid receptor 2
LigandBDBM50277308
Substrate/Competitorn/a
Meas. Tech.ChEMBL_540512 (CHEMBL1030616)
Ki 11±n/a nM
Citation Goodman, AJAjello, CWWorm, KLe Bourdonnec, BSavolainen, MAO'Hare, HCassel, JAStabley, GJDehaven, RNLabuda, CJKoblish, MLittle, PJBrogdon, BLSmith, SADolle, RE CB2 selective sulfamoyl benzamides: optimization of the amide functionality. Bioorg Med Chem Lett19:309-13 (2008) 
 
Cannabinoid receptor 2
Name:Cannabinoid receptor 2
Type:G Protein-Coupled Receptor (GPCR)
Mol. Mass.:39690.94
Organism:Homo sapiens (Human)
Description:P34972
Residue:360
BDBM50277308
NameBDBM50277308
Synonyms:2-tert-butyl-3,3-dimethyl-N-(4-methyl-3-(morpholinosulfonyl)phenyl)butanamide | CHEMBL471671
TypeSmall organic molecule
Emp. Form.C21H34N2O4S
Mol. Mass.410.571
SMILESCc1ccc(NC(=O)C(C(C)(C)C)C(C)(C)C)cc1S(=O)(=O)N1CCOCC1