Reaction Details
TargetCannabinoid receptor 1
LigandBDBM50277192
Substrate/Competitorn/a
Meas. Tech.ChEMBL_540511 (CHEMBL1030615)
Ki 390±n/a nM
Citation Goodman, AJAjello, CWWorm, KLe Bourdonnec, BSavolainen, MAO'Hare, HCassel, JAStabley, GJDehaven, RNLabuda, CJKoblish, MLittle, PJBrogdon, BLSmith, SADolle, RE CB2 selective sulfamoyl benzamides: optimization of the amide functionality. Bioorg Med Chem Lett19:309-13 (2008) 
 
Cannabinoid receptor 1
Name:Cannabinoid receptor 1
Type:G Protein-Coupled Receptor (GPCR)
Mol. Mass.:52868.96
Organism:Homo sapiens (Human)
Description:P21554
Residue:472
BDBM50277192
NameBDBM50277192
Synonyms:4-(5-(4-(cyclohexylmethyl)thiazol-2-yl)-2-methylphenylsulfonyl)morpholine | CHEMBL474896
TypeSmall organic molecule
Emp. Form.C21H28N2O3S2
Mol. Mass.420.589
SMILESCc1ccc(cc1S(=O)(=O)N1CCOCC1)-c1nc(CC2CCCCC2)cs1