Reaction Details
TargetCannabinoid receptor 2
LigandBDBM50277195
Substrate/Competitorn/a
Meas. Tech.ChEMBL_540512 (CHEMBL1030616)
Ki 5.7±n/a nM
Citation Goodman, AJAjello, CWWorm, KLe Bourdonnec, BSavolainen, MAO'Hare, HCassel, JAStabley, GJDehaven, RNLabuda, CJKoblish, MLittle, PJBrogdon, BLSmith, SADolle, RE CB2 selective sulfamoyl benzamides: optimization of the amide functionality. Bioorg Med Chem Lett19:309-13 (2008) 
 
Cannabinoid receptor 2
Name:Cannabinoid receptor 2
Type:G Protein-Coupled Receptor (GPCR)
Mol. Mass.:39690.94
Organism:Homo sapiens (Human)
Description:P34972
Residue:360
BDBM50277195
NameBDBM50277195
Synonyms:4-(5-(4-tert-butylthiazol-2-yl)-2-methylphenylsulfonyl)morpholine | CHEMBL475093
TypeSmall organic molecule
Emp. Form.C18H24N2O3S2
Mol. Mass.380.525
SMILESCc1ccc(cc1S(=O)(=O)N1CCOCC1)-c1nc(cs1)C(C)(C)C