Reaction Details
TargetCannabinoid receptor 2
LigandBDBM50277224
Substrate/Competitorn/a
Meas. Tech.ChEMBL_540512 (CHEMBL1030616)
Ki 82±n/a nM
Citation Goodman, AJAjello, CWWorm, KLe Bourdonnec, BSavolainen, MAO'Hare, HCassel, JAStabley, GJDehaven, RNLabuda, CJKoblish, MLittle, PJBrogdon, BLSmith, SADolle, RE CB2 selective sulfamoyl benzamides: optimization of the amide functionality. Bioorg Med Chem Lett19:309-13 (2008) 
 
Cannabinoid receptor 2
Name:Cannabinoid receptor 2
Type:G Protein-Coupled Receptor (GPCR)
Mol. Mass.:39690.94
Organism:Homo sapiens (Human)
Description:P34972
Residue:360
BDBM50277224
NameBDBM50277224
Synonyms:4-(5-(2-(cyclohexylmethyl)-2H-tetrazol-5-yl)-2-methylphenylsulfonyl)morpholine | CHEMBL475100
TypeSmall organic molecule
Emp. Form.C19H27N5O3S
Mol. Mass.405.514
SMILESCc1ccc(cc1S(=O)(=O)N1CCOCC1)-c1nnn(CC2CCCCC2)n1