Reaction Details
TargetCannabinoid receptor 1
LigandBDBM50277225
Substrate/Competitorn/a
Meas. Tech.ChEMBL_540511 (CHEMBL1030615)
Ki>5000±n/a nM
Citation Goodman, AJAjello, CWWorm, KLe Bourdonnec, BSavolainen, MAO'Hare, HCassel, JAStabley, GJDehaven, RNLabuda, CJKoblish, MLittle, PJBrogdon, BLSmith, SADolle, RE CB2 selective sulfamoyl benzamides: optimization of the amide functionality. Bioorg Med Chem Lett19:309-13 (2008) 
 
Cannabinoid receptor 1
Name:Cannabinoid receptor 1
Type:G Protein-Coupled Receptor (GPCR)
Mol. Mass.:52868.96
Organism:Homo sapiens (Human)
Description:P21554
Residue:472
BDBM50277225
NameBDBM50277225
Synonyms:4-(2-methyl-5-(2H-tetrazol-5-yl)phenylsulfonyl)morpholine | CHEMBL473696
TypeSmall organic molecule
Emp. Form.C12H15N5O3S
Mol. Mass.309.344
SMILESCc1ccc(cc1S(=O)(=O)N1CCOCC1)-c1nnn[nH]1