Reaction Details
TargetCannabinoid receptor 1
LigandBDBM50277226
Substrate/Competitorn/a
Meas. Tech.ChEMBL_540511 (CHEMBL1030615)
Ki 140±n/a nM
Citation Goodman, AJAjello, CWWorm, KLe Bourdonnec, BSavolainen, MAO'Hare, HCassel, JAStabley, GJDehaven, RNLabuda, CJKoblish, MLittle, PJBrogdon, BLSmith, SADolle, RE CB2 selective sulfamoyl benzamides: optimization of the amide functionality. Bioorg Med Chem Lett19:309-13 (2008) 
 
Cannabinoid receptor 1
Name:Cannabinoid receptor 1
Type:G Protein-Coupled Receptor (GPCR)
Mol. Mass.:52868.96
Organism:Homo sapiens (Human)
Description:P21554
Residue:472
BDBM50277226
NameBDBM50277226
Synonyms:4-(2-methyl-5-(5-neopentyl-1H-1,2,4-triazol-3-yl)phenylsulfonyl)morpholine | CHEMBL473697
TypeSmall organic molecule
Emp. Form.C18H26N4O3S
Mol. Mass.378.489
SMILESCc1ccc(cc1S(=O)(=O)N1CCOCC1)-c1nnc(CC(C)(C)C)[nH]1