Reaction Details
TargetCannabinoid receptor 1
LigandBDBM50277227
Substrate/Competitorn/a
Meas. Tech.ChEMBL_540511 (CHEMBL1030615)
Ki 310±n/a nM
Citation Goodman, AJAjello, CWWorm, KLe Bourdonnec, BSavolainen, MAO'Hare, HCassel, JAStabley, GJDehaven, RNLabuda, CJKoblish, MLittle, PJBrogdon, BLSmith, SADolle, RE CB2 selective sulfamoyl benzamides: optimization of the amide functionality. Bioorg Med Chem Lett19:309-13 (2008) 
 
Cannabinoid receptor 1
Name:Cannabinoid receptor 1
Type:G Protein-Coupled Receptor (GPCR)
Mol. Mass.:52868.96
Organism:Homo sapiens (Human)
Description:P21554
Residue:472
BDBM50277227
NameBDBM50277227
Synonyms:4-(5-(5-(cyclohexylmethyl)-1H-1,2,4-triazol-3-yl)-2-methylphenylsulfonyl)morpholine | CHEMBL503518
TypeSmall organic molecule
Emp. Form.C20H28N4O3S
Mol. Mass.404.526
SMILESCc1ccc(cc1S(=O)(=O)N1CCOCC1)-c1nnc(CC2CCCCC2)[nH]1