Reaction Details
TargetCannabinoid receptor 1
LigandBDBM50256274
Substrate/Competitorn/a
Meas. Tech.ChEMBL_515074 (CHEMBL1034816)
IC50 22.6±n/a nM
Citation Hou, DRAlam, SKuan, TCRamanathan, MLin, TPHung, MS 1,2,3-Triazole derivatives as new cannabinoid CB1 receptor antagonists. Bioorg Med Chem Lett19:1022-5 (2009) 
 
Cannabinoid receptor 1
Name:Cannabinoid receptor 1
Type:G Protein-Coupled Receptor (GPCR)
Mol. Mass.:52868.96
Organism:Homo sapiens (Human)
Description:P21554
Residue:472
BDBM50256274
NameBDBM50256274
Synonyms:2-(4,5-bis(2,4-dichlorophenyl)-2H-1,2,3-triazol-2-yl)-N-(2,5-difluorobenzyl)acetamide | CHEMBL521084
TypeSmall organic molecule
Emp. Form.C23H14Cl4F2N4O
Mol. Mass.542.192
SMILESFc1ccc(F)c(CNC(=O)Cn2nc(c(n2)-c2ccc(Cl)cc2Cl)-c2ccc(Cl)cc2Cl)c1