Reaction Details
TargetCannabinoid receptor 1
LigandBDBM50256273
Substrate/Competitorn/a
Meas. Tech.ChEMBL_515076 (CHEMBL1034818)
EC50 17.8±n/a nM
Citation Hou, DRAlam, SKuan, TCRamanathan, MLin, TPHung, MS 1,2,3-Triazole derivatives as new cannabinoid CB1 receptor antagonists. Bioorg Med Chem Lett19:1022-5 (2009) 
 
Cannabinoid receptor 1
Name:Cannabinoid receptor 1
Type:G Protein-Coupled Receptor (GPCR)
Mol. Mass.:52868.96
Organism:Homo sapiens (Human)
Description:P21554
Residue:472
BDBM50256273
NameBDBM50256273
Synonyms:2-(4,5-bis(2,4-dichlorophenyl)-2H-1,2,3-triazol-2-yl)-N-(4-chlorobenzyl)acetamide | CHEMBL480541
TypeSmall organic molecule
Emp. Form.C23H15Cl5N4O
Mol. Mass.540.656
SMILESClc1ccc(CNC(=O)Cn2nc(c(n2)-c2ccc(Cl)cc2Cl)-c2ccc(Cl)cc2Cl)cc1