Reaction Details
TargetCannabinoid receptor 2
LigandBDBM50256120
Substrate/Competitorn/a
Meas. Tech.ChEMBL_515077 (CHEMBL1034819)
IC50>10±n/a nM
Citation Hou, DRAlam, SKuan, TCRamanathan, MLin, TPHung, MS 1,2,3-Triazole derivatives as new cannabinoid CB1 receptor antagonists. Bioorg Med Chem Lett19:1022-5 (2009) 
 
Cannabinoid receptor 2
Name:Cannabinoid receptor 2
Type:G Protein-Coupled Receptor (GPCR)
Mol. Mass.:39690.94
Organism:Homo sapiens (Human)
Description:P34972
Residue:360
BDBM50256120
NameBDBM50256120
Synonyms:CHEMBL515118 | N-benzyl-2-(4-(4-chlorophenyl)-5-(2,4-dichlorophenyl)-2H-1,2,3-triazol-2-yl)acetamide
TypeSmall organic molecule
Emp. Form.C23H17Cl3N4O
Mol. Mass.471.766
SMILESClc1ccc(cc1)-c1nn(CC(=O)NCc2ccccc2)nc1-c1ccc(Cl)cc1Cl