Reaction Details
TargetCannabinoid receptor 2
LigandBDBM50256122
Substrate/Competitorn/a
Meas. Tech.ChEMBL_515077 (CHEMBL1034819)
IC50>10±n/a nM
Citation Hou, DRAlam, SKuan, TCRamanathan, MLin, TPHung, MS 1,2,3-Triazole derivatives as new cannabinoid CB1 receptor antagonists. Bioorg Med Chem Lett19:1022-5 (2009) 
 
Cannabinoid receptor 2
Name:Cannabinoid receptor 2
Type:G Protein-Coupled Receptor (GPCR)
Mol. Mass.:39690.94
Organism:Homo sapiens (Human)
Description:P34972
Residue:360
BDBM50256122
NameBDBM50256122
Synonyms:2-(4,5-bis(2,4-dichlorophenyl)-2H-1,2,3-triazol-2-yl)-N-(2-fluorobenzyl)acetamide | CHEMBL474602
TypeSmall organic molecule
Emp. Form.C23H15Cl4FN4O
Mol. Mass.524.202
SMILESFc1ccccc1CNC(=O)Cn1nc(c(n1)-c1ccc(Cl)cc1Cl)-c1ccc(Cl)cc1Cl