Reaction Details
TargetRetinoic acid receptor RXR-gamma
LigandBDBM50256177
Substrate/Competitorn/a
Meas. Tech.ChEMBL_515111 (CHEMBL1024633)
IC50 2700±n/a nM
Citation Morishita, KYakushiji, NOhsawa, FTakamatsu, KMatsuura, NMakishima, MKawahata, MYamaguchi, KTai, ASasaki, KKakuta, H Replacing alkyl sulfonamide with aromatic sulfonamide in sulfonamide-type RXR agonists favors switch towards antagonist activity. Bioorg Med Chem Lett19:1001-3 (2009) 
 
Retinoic acid receptor RXR-gamma
Name:Retinoic acid receptor RXR-gamma
Type:PROTEIN
Mol. Mass.:50878.26
Organism:Homo sapiens (Human)
Description:ChEMBL_197216
Residue:463
BDBM50256177
NameBDBM50256177
Synonyms:6-(N-(5,5,8,8-tetramethyl-5,6,7,8-tetrahydronaphthalen-2-yl)-4-(trifluoromethyl)phenylsulfonamido)nicotinic acid | CHEMBL471968
TypeSmall organic molecule
Emp. Form.C27H27F3N2O4S
Mol. Mass.532.574
SMILESCC1(C)CCC(C)(C)c2cc(ccc12)N(c1ccc(cn1)C(O)=O)S(=O)(=O)c1ccc(cc1)C(F)(F)F