Reaction Details
TargetRetinoic acid receptor RXR-alpha
LigandBDBM50256123
Substrate/Competitorn/a
Meas. Tech.ChEMBL_515109 (CHEMBL1024631)
IC50>10000±n/a nM
Citation Morishita, KYakushiji, NOhsawa, FTakamatsu, KMatsuura, NMakishima, MKawahata, MYamaguchi, KTai, ASasaki, KKakuta, H Replacing alkyl sulfonamide with aromatic sulfonamide in sulfonamide-type RXR agonists favors switch towards antagonist activity. Bioorg Med Chem Lett19:1001-3 (2009) 
 
Retinoic acid receptor RXR-alpha
Name:Retinoic acid receptor RXR-alpha
Type:PROTEIN
Mol. Mass.:50820.38
Organism:Homo sapiens (Human)
Description:ChEMBL_1456363
Residue:462
BDBM50256123
NameBDBM50256123
Synonyms:6-(N-(5,5,8,8-tetramethyl-5,6,7,8-tetrahydronaphthalen-2-yl)butylsulfonamido)nicotinic acid | CHEMBL474610
TypeSmall organic molecule
Emp. Form.C24H32N2O4S
Mol. Mass.444.587
SMILESCCCCS(=O)(=O)N(c1ccc2c(c1)C(C)(C)CCC2(C)C)c1ccc(cn1)C(O)=O