Reaction Details
TargetRetinoic acid receptor RXR-gamma
LigandBDBM50256275
Substrate/Competitorn/a
Meas. Tech.ChEMBL_515111 (CHEMBL1024633)
IC50>10000±n/a nM
Citation Morishita, KYakushiji, NOhsawa, FTakamatsu, KMatsuura, NMakishima, MKawahata, MYamaguchi, KTai, ASasaki, KKakuta, H Replacing alkyl sulfonamide with aromatic sulfonamide in sulfonamide-type RXR agonists favors switch towards antagonist activity. Bioorg Med Chem Lett19:1001-3 (2009) 
 
Retinoic acid receptor RXR-gamma
Name:Retinoic acid receptor RXR-gamma
Type:PROTEIN
Mol. Mass.:50878.26
Organism:Homo sapiens (Human)
Description:ChEMBL_197216
Residue:463
BDBM50256275
NameBDBM50256275
Synonyms:6-(4-nitro-N-(5,5,8,8-tetramethyl-5,6,7,8-tetrahydronaphthalen-2-yl)phenylsulfonamido)nicotinic acid | CHEMBL480548
TypeSmall organic molecule
Emp. Form.C26H27N3O6S
Mol. Mass.509.574
SMILESCC1(C)CCC(C)(C)c2cc(ccc12)N(c1ccc(cn1)C(O)=O)S(=O)(=O)c1ccc(cc1)[N+]([O-])=O