Reaction Details
TargetSolute carrier family 28 member 3
LigandBDBM20875
Substrate/Competitorn/a
Meas. Tech.ChEMBL_518727 (CHEMBL957102)
Ki 16000±n/a nM
Citation Gupte, ABuolamwini, JK Synthesis and biological evaluation of phloridzin analogs as human concentrative nucleoside transporter 3 (hCNT3) inhibitors. Bioorg Med Chem Lett19:917-21 (2009) 
 
Solute carrier family 28 member 3
Name:Solute carrier family 28 member 3
Type:PROTEIN
Mol. Mass.:76938.51
Organism:Homo sapiens (Human)
Description:ChEMBL_1494517
Residue:691
BDBM20875
NameBDBM20875
Synonyms:1-(2,4-dihydroxy-6-{[(2S,3R,4S,5S,6R)-3,4,5-trihydroxy-6-(hydroxymethyl)oxan-2-yl]oxy}phenyl)-3-(4-hydroxyphenyl)propan-1-one CHEMBL245067 O-glucoside, 1 | Phlorizin
TypeNatural product
Emp. Form.C21H24O10
Mol. Mass.436.4093
SMILESOC[C@H]1O[C@@H](Oc2cc(O)cc(O)c2C(=O)CCc2ccc(O)cc2)[C@H](O)[C@@H](O)[C@@H]1O