Reaction Details
TargetCyclin-dependent kinase 2
LigandBDBM50256750
Substrate/Competitorn/a
Meas. Tech.ChEMBL_519334 (CHEMBL947786)
IC50>30000±n/a nM
Citation Lyne, PDAquila, BCook, DJDakin, LAEzhuthachan, JIoannidis, SPontz, TSu, MYe, QZheng, XBlock, MHCowen, SDeegan, TLLee, JWScott, DACusteau, DDrew, LPoondru, SShen, MWu, A Identification of amidoheteroaryls as potent inhibitors of mutant (V600E) B-Raf kinase with in vivo activity. Bioorg Med Chem Lett19:1026-9 (2009) 
 
Cyclin-dependent kinase 2
Name:Cyclin-dependent kinase 2
Type:Enzyme Subunit
Mol. Mass.:33938.17
Organism:Homo sapiens (Human)
Description:P24941
Residue:298
BDBM50256750
NameBDBM50256750
Synonyms:CHEMBL475817 | N-(6-amino-5-chloropyridin-3-yl)-2-chloro-5-(3-(trifluoromethyl)benzamido)benzamide
TypeSmall organic molecule
Emp. Form.C20H13Cl2F3N4O2
Mol. Mass.469.244
SMILESNc1ncc(NC(=O)c2cc(NC(=O)c3cccc(c3)C(F)(F)F)ccc2Cl)cc1Cl