Reaction Details
TargetCarbonyl reductase [NADPH] 1
LigandBDBM7461
Substrate/Competitorn/a
Meas. Tech.ChEMBL_495288 (CHEMBL1004505)
Ki 110±n/a nM
Citation Zimmermann, TJNiesen, FHPilka, ESKnapp, SOppermann, UMaier, ME Discovery of a potent and selective inhibitor for human carbonyl reductase 1 from propionate scanning applied to the macrolide zearalenone. Bioorg Med Chem17:530-6 (2009) 
 
Carbonyl reductase [NADPH] 1
Name:Carbonyl reductase [NADPH] 1
Type:PROTEIN
Mol. Mass.:30380.63
Organism:Homo sapiens (Human)
Description:ChEMBL_607770
Residue:277
BDBM7461
NameBDBM7461
Synonyms:5,7-dihydroxy-2-phenyl-4H-chromen-4-one 5,7-dihydroxyflavone chrysin | cid_5281607
TypeSmall organic molecule
Emp. Form.C15H10O4
Mol. Mass.254.2375
SMILESOc1cc(O)c2c(c1)oc(cc2=O)-c1ccccc1