Reaction Details
TargetCarbonyl reductase [NADPH] 1
LigandBDBM9461
Substrate/Competitorn/a
Meas. Tech.ChEMBL_495288 (CHEMBL1004505)
Ki 2030.0±n/a nM
Citation Zimmermann, TJNiesen, FHPilka, ESKnapp, SOppermann, UMaier, ME Discovery of a potent and selective inhibitor for human carbonyl reductase 1 from propionate scanning applied to the macrolide zearalenone. Bioorg Med Chem17:530-6 (2009) 
 
Carbonyl reductase [NADPH] 1
Name:Carbonyl reductase [NADPH] 1
Type:PROTEIN
Mol. Mass.:30380.63
Organism:Homo sapiens (Human)
Description:ChEMBL_607770
Residue:277
BDBM9461
NameBDBM9461
Synonyms:5,7-dihydroxy-3-(4-methoxyphenyl)-4H-chromen-4-one Biochanin A (BCA) CHEMBL131921 | cid_5280373
TypeSmall organic molecule
Emp. Form.C16H12O5
Mol. Mass.284.2635
SMILESCOc1ccc(cc1)-c1coc2cc(O)cc(O)c2c1=O