Reaction Details
TargetCarbonic anhydrase 2
LigandBDBM50153971
Substrate/Competitorn/a
Meas. Tech.ChEMBL_495458 (CHEMBL1005300)
Ki 106±n/a nM
Citation Thiry, ALedecq, MCecchi, AFrederick, RDogné, JMSupuran, CTWouters, JMasereel, B Ligand-based and structure-based virtual screening to identify carbonic anhydrase IX inhibitors. Bioorg Med Chem17:553-7 (2009) 
 
Carbonic anhydrase 2
Name:Carbonic anhydrase 2
Type:Enzyme
Mol. Mass.:29250.71
Organism:Homo sapiens (Human)
Description:P00918
Residue:260
BDBM50153971
NameBDBM50153971
Synonyms:4-(4,6-Dichloro-[1,3,5]triazin-2-ylamino)-benzenesulfonamide CHEMBL366069
TypeSmall organic molecule
Emp. Form.C9H7Cl2N5O2S
Mol. Mass.320.155
SMILESNS(=O)(=O)c1ccc(Nc2nc(Cl)nc(Cl)n2)cc1