Reaction Details
TargetCarbonic anhydrase 9
LigandBDBM10861
Substrate/Competitorn/a
Meas. Tech.ChEMBL_495459 (CHEMBL1005301)
Ki 33±n/a nM
Citation Thiry, ALedecq, MCecchi, AFrederick, RDogné, JMSupuran, CTWouters, JMasereel, B Ligand-based and structure-based virtual screening to identify carbonic anhydrase IX inhibitors. Bioorg Med Chem17:553-7 (2009) 
 
Carbonic anhydrase 9
Name:Carbonic anhydrase 9
Type:Enzyme
Mol. Mass.:49669.03
Organism:Homo sapiens (Human)
Description:Catalytic domain of human cloned isozyme was used in the assay
Residue:459
BDBM10861
NameBDBM10861
Synonyms:4-(2-aminoethyl)benzene-1-sulfonamide aromatic sulfonamide compound 7 | aromatic/heteroaromatic sulfonamide 6
TypeSmall organic molecule
Emp. Form.C8H12N2O2S
Mol. Mass.200.258
SMILESNCCc1ccc(cc1)S(N)(=O)=O