Reaction Details
TargetCarbonic anhydrase 9
LigandBDBM50153964
Substrate/Competitorn/a
Meas. Tech.ChEMBL_495459 (CHEMBL1005301)
Ki 0.34±n/a nM
Citation Thiry, ALedecq, MCecchi, AFrederick, RDogné, JMSupuran, CTWouters, JMasereel, B Ligand-based and structure-based virtual screening to identify carbonic anhydrase IX inhibitors. Bioorg Med Chem17:553-7 (2009) 
 
Carbonic anhydrase 9
Name:Carbonic anhydrase 9
Type:Enzyme
Mol. Mass.:49669.03
Organism:Homo sapiens (Human)
Description:Catalytic domain of human cloned isozyme was used in the assay
Residue:459
BDBM50153964
NameBDBM50153964
Synonyms:4-((4,6-diethoxy-1,3,5-triazin-2-ylamino)methyl)benzenesulfonamide CHEMBL183945
TypeSmall organic molecule
Emp. Form.C14H19N5O4S
Mol. Mass.353.397
SMILESCCOc1nc(NCc2ccc(cc2)S(N)(=O)=O)nc(OCC)n1