Reaction Details
TargetInsulin-like growth factor 1 receptor
LigandBDBM50256466
Substrate/Competitorn/a
Meas. Tech.ChEMBL_519402 (CHEMBL948823)
IC50 7±n/a nM
Citation Emmitte, KAWilson, BJBaum, EWEmerson, HKKuntz, KWNailor, KESalovich, JMSmith, SCCheung, MGerding, RMStevens, KLUehling, DEMook, RAMoorthy, GSDickerson, SHHassell, AMLeesnitzer, MAShewchuk, LMGroy, ARowand, JLAnderson, KAtkins, CLYang, JSabbatini, PKumar, R Discovery and optimization of imidazo[1,2-a]pyridine inhibitors of insulin-like growth factor-1 receptor (IGF-1R). Bioorg Med Chem Lett19:1004-8 (2009) 
 
Insulin-like growth factor 1 receptor
Name:Insulin-like growth factor 1 receptor
Type:Protein
Mol. Mass.:154776.79
Organism:Homo sapiens (Human)
Description:P08069
Residue:1367
BDBM50256466
NameBDBM50256466
Synonyms:CHEMBL444031 | N-(2,6-difluorophenyl)-3-(3-(2-(2,3-dihydrobenzo[b][1,4]dioxin-6-ylamino)pyrimidin-4-yl)imidazo[1,2-a]pyridin-2-yl)benzamide
TypeSmall organic molecule
Emp. Form.C32H22F2N6O3
Mol. Mass.576.5523
SMILESFc1cccc(F)c1NC(=O)c1cccc(c1)-c1nc2ccccn2c1-c1ccnc(Nc2ccc3OCCOc3c2)n1