Reaction Details
TargetInsulin-like growth factor 1 receptor
LigandBDBM50256475
Substrate/Competitorn/a
Meas. Tech.ChEMBL_519403 (CHEMBL948824)
IC50 28±n/a nM
Citation Emmitte, KAWilson, BJBaum, EWEmerson, HKKuntz, KWNailor, KESalovich, JMSmith, SCCheung, MGerding, RMStevens, KLUehling, DEMook, RAMoorthy, GSDickerson, SHHassell, AMLeesnitzer, MAShewchuk, LMGroy, ARowand, JLAnderson, KAtkins, CLYang, JSabbatini, PKumar, R Discovery and optimization of imidazo[1,2-a]pyridine inhibitors of insulin-like growth factor-1 receptor (IGF-1R). Bioorg Med Chem Lett19:1004-8 (2009) 
 
Insulin-like growth factor 1 receptor
Name:Insulin-like growth factor 1 receptor
Type:Protein
Mol. Mass.:154776.79
Organism:Homo sapiens (Human)
Description:P08069
Residue:1367
BDBM50256475
NameBDBM50256475
Synonyms:CHEMBL449110 | N-(2,6-difluorophenyl)-3-(3-(2-(2-methoxy-4-(4-(4-methylpiperazin-1-yl)piperidin-1-yl)phenylamino)pyrimidin-4-yl)imidazo[1,2-a]pyridin-2-yl)benzamide
TypeSmall organic molecule
Emp. Form.C41H41F2N9O2
Mol. Mass.729.8201
SMILESCOc1cc(ccc1Nc1nccc(n1)-c1c(nc2ccccn12)-c1cccc(c1)C(=O)Nc1c(F)cccc1F)N1CCC(CC1)N1CCN(C)CC1