Reaction Details
TargetMitogen-activated protein kinase 14
LigandBDBM50256471
Substrate/Competitorn/a
Meas. Tech.ChEMBL_519648 (CHEMBL946775)
IC50 130±n/a nM
Citation Emmitte, KAWilson, BJBaum, EWEmerson, HKKuntz, KWNailor, KESalovich, JMSmith, SCCheung, MGerding, RMStevens, KLUehling, DEMook, RAMoorthy, GSDickerson, SHHassell, AMLeesnitzer, MAShewchuk, LMGroy, ARowand, JLAnderson, KAtkins, CLYang, JSabbatini, PKumar, R Discovery and optimization of imidazo[1,2-a]pyridine inhibitors of insulin-like growth factor-1 receptor (IGF-1R). Bioorg Med Chem Lett19:1004-8 (2009) 
 
Mitogen-activated protein kinase 14
Name:Mitogen-activated protein kinase 14
Type:Serine/threonine-protein kinase
Mol. Mass.:41286.76
Organism:Homo sapiens (Human)
Description:Q16539
Residue:360
BDBM50256471
NameBDBM50256471
Synonyms:3-(3-(2-(4-(1,4'-bipiperidin-1'-yl)-2-methoxyphenylamino)pyrimidin-4-yl)imidazo[1,2-a]pyridin-2-yl)-N-(2,6-difluorophenyl)benzamide | CHEMBL506862
TypeSmall organic molecule
Emp. Form.C41H40F2N8O2
Mol. Mass.714.8055
SMILESCOc1cc(ccc1Nc1nccc(n1)-c1c(nc2ccccn12)-c1cccc(c1)C(=O)Nc1c(F)cccc1F)N1CCC(CC1)N1CCCCC1