Reaction Details
TargetReceptor tyrosine-protein kinase erbB-2
LigandBDBM50256480
Substrate/Competitorn/a
Meas. Tech.ChEMBL_519645 (CHEMBL946772)
IC50>10000±n/a nM
Citation Emmitte, KAWilson, BJBaum, EWEmerson, HKKuntz, KWNailor, KESalovich, JMSmith, SCCheung, MGerding, RMStevens, KLUehling, DEMook, RAMoorthy, GSDickerson, SHHassell, AMLeesnitzer, MAShewchuk, LMGroy, ARowand, JLAnderson, KAtkins, CLYang, JSabbatini, PKumar, R Discovery and optimization of imidazo[1,2-a]pyridine inhibitors of insulin-like growth factor-1 receptor (IGF-1R). Bioorg Med Chem Lett19:1004-8 (2009) 
 
Receptor tyrosine-protein kinase erbB-2
Name:Receptor tyrosine-protein kinase erbB-2
Type:n/a
Mol. Mass.:137894.47
Organism:Homo sapiens (Human)
Description:P04626
Residue:1255
BDBM50256480
NameBDBM50256480
Synonyms:CHEMBL466397 | N-(2,6-difluorophenyl)-5-(3-(2-(5-ethyl-2-methoxy-4-(4-(4-(methylsulfonyl)piperazin-1-yl)piperidin-1-yl)phenylamino)pyrimidin-4-yl)imidazo[1,2-a]pyridin-2-yl)-2-methoxybenzamide
TypeSmall organic molecule
Emp. Form.C44H47F2N9O5S
Mol. Mass.851.963
SMILESCCc1cc(Nc2nccc(n2)-c2c(nc3ccccn23)-c2ccc(OC)c(c2)C(=O)Nc2c(F)cccc2F)c(OC)cc1N1CCC(CC1)N1CCN(CC1)S(C)(=O)=O